Win a copy of Programmer's Guide to Java SE 8 Oracle Certified Associate (OCA) this week in the OCAJP forum!
  • Post Reply
  • Bookmark Topic Watch Topic
  • New Topic

Surefire Plugin in maven

 
Dhivya Krishnan
Ranch Hand
Posts: 68
  • Mark post as helpful
  • send pies
  • Quote
  • Report post to moderator
HI.,
In maven,I need to skip tests while executing.I used maven-surefire plugin for that.But still those tests get executed.
<plugin>
<groupId>org.apache.maven.plugins</groupId>
<artifactId>maven-surefire-plugin</artifactId>
<version>2.1.3</version>
<configuration>
<skipTests>true</skipTests>
<testFailureIgnore>true</testFailureIgnore>
</configuration>
</plugin>
Can someone help me telling why these scripts gets executed even after including this plugin. I get this error.

Tests run: 1, Failures: 1, Errors: 0, Skipped: 0

[INFO] ------------------------------------------------------------------------
[ERROR] BUILD FAILURE
[INFO] ------------------------------------------------------------------------
[INFO] There are test failures.
[INFO] ------------------------------------------------------------------------
[INFO] Trace
org.apache.maven.BuildFailureException: There are test failures.
at org.apache.maven.lifecycle.DefaultLifecycleExecutor.executeGoals(DefaultLifecycleExecutor.java:579)
at org.apache.maven.lifecycle.DefaultLifecycleExecutor.executeGoalWithLifecycle(DefaultLifecycleExecutor.java:499)
at org.apache.maven.lifecycle.DefaultLifecycleExecutor.executeGoal(DefaultLifecycleExecutor.java:478)
at org.apache.maven.lifecycle.DefaultLifecycleExecutor.executeGoalAndHandleFailures(DefaultLifecycleExecutor.java:330)
at org.apache.maven.lifecycle.DefaultLifecycleExecutor.executeTaskSegments(DefaultLifecycleExecutor.java:291)
at org.apache.maven.lifecycle.DefaultLifecycleExecutor.execute(DefaultLifecycleExecutor.java:142)
at org.apache.maven.DefaultMaven.doExecute(DefaultMaven.java:336)
at org.apache.maven.DefaultMaven.execute(DefaultMaven.java:129)
at org.apache.maven.cli.MavenCli.main(MavenCli.java:287)
at sun.reflect.NativeMethodAccessorImpl.invoke0(Native Method)
at sun.reflect.NativeMethodAccessorImpl.invoke(NativeMethodAccessorImpl.java:39)
at sun.reflect.DelegatingMethodAccessorImpl.invoke(DelegatingMethodAccessorImpl.java:25)
at java.lang.reflect.Method.invoke(Method.java:597)
at org.codehaus.classworlds.Launcher.launchEnhanced(Launcher.java:315)
at org.codehaus.classworlds.Launcher.launch(Launcher.java:255)
at org.codehaus.classworlds.Launcher.mainWithExitCode(Launcher.java:430)
at org.codehaus.classworlds.Launcher.main(Launcher.java:375)
Caused by: org.apache.maven.plugin.MojoFailureException: There are test failures.
at org.apache.maven.plugin.surefire.SurefirePlugin.execute(SurefirePlugin.java:425)
at org.apache.maven.plugin.DefaultPluginManager.executeMojo(DefaultPluginManager.java:451)
at org.apache.maven.lifecycle.DefaultLifecycleExecutor.executeGoals(DefaultLifecycleExecutor.java:558)
... 16 more
 
Martijn Verburg
author
Bartender
Posts: 3275
5
Eclipse IDE Java Mac OS X
  • Mark post as helpful
  • send pies
  • Quote
  • Report post to moderator
I would try a newer version of the plugin.
 
Dhivya Krishnan
Ranch Hand
Posts: 68
  • Mark post as helpful
  • send pies
  • Quote
  • Report post to moderator
yes got the solution using higher version.
 
  • Post Reply
  • Bookmark Topic Watch Topic
  • New Topic