Win a copy of Svelte and Sapper in Action this week in the JavaScript forum!
  • Post Reply Bookmark Topic Watch Topic
  • New Topic
programming forums Java Mobile Certification Databases Caching Books Engineering Micro Controllers OS Languages Paradigms IDEs Build Tools Frameworks Application Servers Open Source This Site Careers Other all forums
this forum made possible by our volunteer staff, including ...
Marshals:
  • Campbell Ritchie
  • Ron McLeod
  • Paul Clapham
  • Bear Bibeault
  • Junilu Lacar
Sheriffs:
  • Jeanne Boyarsky
  • Tim Cooke
  • Henry Wong
Saloon Keepers:
  • Tim Moores
  • Stephan van Hulst
  • Tim Holloway
  • salvin francis
  • Frits Walraven
Bartenders:
  • Scott Selikoff
  • Piet Souris
  • Carey Brown

Failed to execute goal org.codehaus.mojo:gwt-maven-plugin:2.4.0:compile (compile-gwt)

 
Greenhorn
Posts: 4
  • Mark post as helpful
  • send pies
  • Quote
  • Report post to moderator
Hi

While doing build gwt application using maven tool.I am getting below error.

Results :

Tests run: 0, Failures: 0, Errors: 0, Skipped: 0

[INFO]
[INFO] --- gwt-maven-plugin:2.4.0:compile (compile-gwt) @ oppapps-war ---
Downloading: http://repo.maven.apache.org/maven2/com/google/gwt/gwt-dev/2.4.0/gwt-dev-2.4.0.jar
[INFO] ------------------------------------------------------------------------
[INFO] BUILD FAILURE
[INFO] ------------------------------------------------------------------------
[INFO] Total time: 2:11.741s
[INFO] Finished at: Tue Mar 24 08:09:30 IST 2015
[INFO] Final Memory: 15M/178M
[INFO] ------------------------------------------------------------------------
[ERROR] Failed to execute goal org.codehaus.mojo:gwt-maven-plugin:2.4.0:compile (compile-gwt) on project oppapps-war: Execution compile-gwt of goal org.codehaus.mojo:gwt-maven-plugin:2.4.0:compile failed: Plugin org.codehaus.mojo:gwt-maven-plugin:2.4.0 or one of its dependencies could not be resolve
d: Could not transfer artifact com.google.gwt:gwt-dev:jar:2.4.0 from/to central (http://repo.maven.apache.org/maven2): GET request of: com/google/gwt/gwt-dev/2.4.0/gwt-dev-2.4.0.jar from central failed: Premature end of Content-Length delimited message body (expected: 28310518; received: 28309967 ->
[Help 1]
[ERROR]
[ERROR] To see the full stack trace of the errors, re-run Maven with the -e switch.
[ERROR] Re-run Maven using the -X switch to enable full debug logging.
[ERROR]
[ERROR] For more information about the errors and possible solutions, please read the following articles:
[ERROR] [Help 1] http://cwiki.apache.org/confluence/display/MAVEN/PluginResolutionException
 
Rancher
Posts: 2759
32
Eclipse IDE Spring Tomcat Server
  • Mark post as helpful
  • send pies
  • Quote
  • Report post to moderator
There was a problem while downloading the jar from maven repository. It might be a temporary issue. Just try to run the build again, it might resolve itself
 
Acetylsalicylic acid is aspirin. This could be handy too:
Thread Boost feature
https://coderanch.com/t/674455/Thread-Boost-feature
    Bookmark Topic Watch Topic
  • New Topic