Granny's Programming Pearls
"inside of every large program is a small program struggling to get out"
JavaRanch.com/granny.jsp

Karan Pant

Greenhorn
+ Follow
since Jul 28, 2014
Cows and Likes
Cows
Total received
0
In last 30 days
0
Total given
0
Likes
Total received
0
Received in last 30 days
0
Total given
2
Given in last 30 days
0
Forums and Threads
Scavenger Hunt
expand Ranch Hand Scavenger Hunt
expand Greenhorn Scavenger Hunt

Recent posts by Karan Pant

Hello all, I am developing a project by following tutorials. I have developed a maven project called library-app. This parent project contains maven modules called library-model, library-resource and library-int-tests.  When I run the command mvn clean install -PintegrationTests-wildfly -e where integrationTests-wildfly is the profile name used in library-int-tests module, i get a build failure error.
The error looks like this

[ERROR] Failed to execute goal org.apache.maven.plugins:maven-compiler-plugin:3.2:testCompile (default-testCompile) on project library-int-tests: Unable to parse configuration of mojo org.apache.maven.plugins:maven-compiler-plugin:3.2:testCompile for parameter testIncludes: Basic element 'includes' must not contain child elements -> [Help 1]
org.apache.maven.lifecycle.LifecycleExecutionException: Failed to execute goal org.apache.maven.plugins:maven-compiler-plugin:3.2:testCompile (default-testCompile) on project library-int-tests: Unable to parse configuration of mojo org.apache.maven.plugins:maven-compiler-plugin:3.2:testCompile for parameter testIncludes: Basic element 'includes' must not contain child elements
at org.apache.maven.lifecycle.internal.MojoExecutor.execute(MojoExecutor.java:212)
at org.apache.maven.lifecycle.internal.MojoExecutor.execute(MojoExecutor.java:153)
at org.apache.maven.lifecycle.internal.MojoExecutor.execute(MojoExecutor.java:145)
at org.apache.maven.lifecycle.internal.LifecycleModuleBuilder.buildProject(LifecycleModuleBuilder.java:116)
at org.apache.maven.lifecycle.internal.LifecycleModuleBuilder.buildProject(LifecycleModuleBuilder.java:80)
at org.apache.maven.lifecycle.internal.builder.singlethreaded.SingleThreadedBuilder.build(SingleThreadedBuilder.java:51)
at org.apache.maven.lifecycle.internal.LifecycleStarter.execute(LifecycleStarter.java:128)
at org.apache.maven.DefaultMaven.doExecute(DefaultMaven.java:307)
at org.apache.maven.DefaultMaven.doExecute(DefaultMaven.java:193)
at org.apache.maven.DefaultMaven.execute(DefaultMaven.java:106)
at org.apache.maven.cli.MavenCli.execute(MavenCli.java:863)
at org.apache.maven.cli.MavenCli.doMain(MavenCli.java:288)
at org.apache.maven.cli.MavenCli.main(MavenCli.java:199)
at sun.reflect.NativeMethodAccessorImpl.invoke0(Native Method)
at sun.reflect.NativeMethodAccessorImpl.invoke(NativeMethodAccessorImpl.java:62)
at sun.reflect.DelegatingMethodAccessorImpl.invoke(DelegatingMethodAccessorImpl.java:43)
at java.lang.reflect.Method.invoke(Method.java:483)
at org.codehaus.plexus.classworlds.launcher.Launcher.launchEnhanced(Launcher.java:289)
at org.codehaus.plexus.classworlds.launcher.Launcher.launch(Launcher.java:229)
at org.codehaus.plexus.classworlds.launcher.Launcher.mainWithExitCode(Launcher.java:415)
at org.codehaus.plexus.classworlds.launcher.Launcher.main(Launcher.java:356)
Caused by: org.apache.maven.plugin.PluginConfigurationException: Unable to parse configuration of mojo org.apache.maven.plugins:maven-compiler-plugin:3.2:testCompile for parameter testIncludes: Basic element 'includes' must not contain child elements
at org.apache.maven.plugin.internal.DefaultMavenPluginManager.populatePluginFields(DefaultMavenPluginManager.java:662)
at org.apache.maven.plugin.internal.DefaultMavenPluginManager.getConfiguredMojo(DefaultMavenPluginManager.java:594)

This failure happens when building library-int-tests. Here is the pom.xml for the module library-int-tests.


Please help me find the solution for this. It's been more than 2 days and i haven't found any solution on the web.
2 years ago
Close cmd, and launch it again.

Make sure you have set the environment variables correctly

Add a user variable 'with
Variable Name:- JAVA_HOME
Variable Value :- C:\Program Files\Java\jdk1.8.0_20

and go to path system variable and add this line to the front(%JAVA_HOME%\bin;)
3 years ago
Hi,
I want to develop an application, which shows a circular window with close, maximize buttons.

I want some hints.

Please, have a look at this video. I want to create something like this: https://www.youtube.com/watch?v=oV-AfqAIsJE

Thanks
4 years ago
Hello Sir,
How does memory leak affect security? How do we check and avoid memory leaks?
4 years ago
I missed it. Congrats to you guys
4 years ago